Target
UDP-galactopyranose mutase
Ligand
BDBM68243
Substrate
Meas. Tech.
High-throughput FP Assay
Kd
>3.3e+4±n/a nM
Citation
 Carlson, EEMay, JFKiessling, LL Chemical probes of UDP-galactopyranose mutase. Chem Biol 13:825-37 (2006)  
Target
Name:
UDP-galactopyranose mutase
Synonyms:
Type:
Protein
Mol. Mass.:
44526.00
Organism:
Klebsiella pneumoniae
Description:
Q762K7
Residue:
384
  
Inhibitor
Name:
BDBM68243
Synonyms:
Thiazolidinone core, 28
Type:
Small organic molecule
Emp. Form.:
C20H17NO4S2
Mol. Mass.:
399.483
SMILES:
COc1cccc(\C=C2\SC(=S)N(C(Cc3ccccc3)C(O)=O)C2=O)c1
: