Target
ATP-dependent molecular chaperone HSP82
Ligand
BDBM68253
Substrate
Meas. Tech.
Malachite Green Assay
IC50
>1.00e+5±n/a nM
Citation
 Proisy, NSharp, SYBoxall, KConnelly, SRoe, SMProdromou, CSlawin, AMPearl, LHWorkman, PMoody, CJ Inhibition of Hsp90 with synthetic macrolactones: synthesis and structural and biological evaluation of ring and conformational analogs of radicicol. Chem Biol 13:1203-15 (2006)  
Target
Name:
ATP-dependent molecular chaperone HSP82
Synonyms:
82 kDa heat shock protein HSP82 HSP90 Heat shock protein Hsp90 heat-inducible isoform
Type:
Molecular Chaperone
Mol. Mass.:
81369.08
Organism:
Saccharomyces cerevisiae
Description:
Histidine-tagged yeast HSP90 was transformed into E. coli and purified (>90%) by metal affinity, gel filtration, and ion-exchange chromatography.
Residue:
709
  
Inhibitor
Name:
BDBM68253
Synonyms:
Microlactone, 25
Type:
Small organic molecule
Emp. Form.:
C20H25ClO5
Mol. Mass.:
380.863
SMILES:
COc1cc(OC)c2c(CC(=O)CCCC\C=C\CC(C)OC2=O)c1Cl
: