Target
Beta-hexosaminidase subunit alpha
Ligand
BDBM68270
Substrate
Meas. Tech.
Enzyme Inhibition Assay
Temperature
298.15±0 K
IC50
1.6e+4± 1.5e+3 nM
Citation
 Tropak, MBBlanchard, JEWithers, SGBrown, EDMahuran, D High-throughput screening for human lysosomal beta-N-Acetyl hexosaminidase inhibitors acting as pharmacological chaperones. Chem Biol 14:153-64 (2007)  
Target
Name:
Beta-hexosaminidase subunit alpha
Synonyms:
Beta-N-acetylhexosaminidase subunit alpha HEXA | HEXA_HUMAN
Type:
Protein
Mol. Mass.:
60688.46
Organism:
Homo sapiens (Human)
Description:
P06865
Residue:
529
  
Inhibitor
Name:
BDBM68270
Synonyms:
5141402
Type:
Small organic molecule
Emp. Form.:
C15H13NO3
Mol. Mass.:
255.2686
SMILES:
OCCCN1C(=O)c2cccc3cccc(C1=O)c23
: