Target
3-oxoacyl-[acyl-carrier-protein] synthase 3
Ligand
BDBM68275
Substrate
Meas. Tech.
FabH Enzyme Assay
pH
7±0
Temperature
310.15±0 K
IC50
>3.00e+5±n/a nM
Citation
 Alhamadsheh, MMMusayev, FKomissarov, AASachdeva, SWright, HTScarsdale, NFlorova, GReynolds, KA Alkyl-CoA disulfides as inhibitors and mechanistic probes for FabH enzymes. Chem Biol 14:513-24 (2007)  
Target
Name:
3-oxoacyl-[acyl-carrier-protein] synthase 3
Synonyms:
3-oxoacyl-[acyl-carrier-protein] synthase Beta-ketoacyl-ACP synthase III (FabH) fabH
Type:
Enzyme
Mol. Mass.:
34865.07
Organism:
Mycobacterium tuberculosis
Description:
P9WNG2
Residue:
335
  
Inhibitor
Name:
BDBM68275
Synonyms:
Methyl-CoA disulfide 1
Type:
Small organic molecule
Emp. Form.:
C21H36N7O16P3S2
Mol. Mass.:
799.599
SMILES:
CSSCCNC(=O)CCNC(=O)C(O)C(C)(C)OP(O)(=O)OP(O)(=O)OCC1OC(C(O)C1OP(O)(O)=O)n1cnc2c(N)ncnc12
: