Target
3-oxoacyl-[acyl-carrier-protein] synthase 3
Ligand
BDBM68277
Substrate
Meas. Tech.
FabH Enzyme Assay
pH
7±0
Temperature
310.15±0 K
IC50
3.01e+4± 5.2e+3 nM
Citation
 Alhamadsheh, MMMusayev, FKomissarov, AASachdeva, SWright, HTScarsdale, NFlorova, GReynolds, KA Alkyl-CoA disulfides as inhibitors and mechanistic probes for FabH enzymes. Chem Biol 14:513-24 (2007)  
Target
Name:
3-oxoacyl-[acyl-carrier-protein] synthase 3
Synonyms:
3-oxoacyl-[acyl-carrier-protein] synthase Beta-ketoacyl-ACP synthase III (FabH) fabH
Type:
Enzyme
Mol. Mass.:
34865.07
Organism:
Mycobacterium tuberculosis
Description:
P9WNG2
Residue:
335
  
Inhibitor
Name:
BDBM68277
Synonyms:
Octyl-CoA disulfide 4
Type:
Small organic molecule
Emp. Form.:
C28H50N7O16P3S2
Mol. Mass.:
897.785
SMILES:
CCCCCCCCSSCCNC(=O)CCNC(=O)C(O)C(C)(C)OP(O)(=O)OP(O)(=O)OCC1OC(C(O)C1OP(O)(O)=O)n1cnc2c(N)ncnc12
: