Target
Cytochrome P450 1B1
Ligand
BDBM50045924
Substrate
Meas. Tech.
EROD Assay
pH
8±0
Temperature
310.15±0 K
Ki
74.3±n/a nM
Km
158±0 nM
Citation
 Katsuyama, YFuna, NMiyahisa, IHorinouchi, S Synthesis of unnatural flavonoids and stilbenes by exploiting the plant biosynthetic pathway in Escherichia coli. Chem Biol 14:613-21 (2007)  
Target
Name:
Cytochrome P450 1B1
Synonyms:
CP1B1_HUMAN CYPIB1 | Cytochrome P450 1B1 (CYP1B1)
Type:
PROTEIN
Mol. Mass.:
60861.81
Organism:
Homo sapiens (Human)
Description:
ChEMBL_1474523
Residue:
543
  
Inhibitor
Name:
BDBM50045924
Synonyms:
(E)-3,5-stilbenediol 5-[(1E)-2-phenylethenyl]benzene-1,3-diol CHEMBL101506 pinosylvine trans-pinosylvin
Type:
Small organic molecule
Emp. Form.:
C14H12O2
Mol. Mass.:
212.2439
SMILES:
Oc1cc(O)cc(\C=C\c2ccccc2)c1
: