Target
Cytochrome P450 1B1
Ligand
BDBM50247272
Substrate
Meas. Tech.
EROD Assay
pH
8±0
Temperature
310.15±0 K
Ki
323±n/a nM
Km
276±0 nM
Citation
 Katsuyama, YFuna, NMiyahisa, IHorinouchi, S Synthesis of unnatural flavonoids and stilbenes by exploiting the plant biosynthetic pathway in Escherichia coli. Chem Biol 14:613-21 (2007)  
Target
Name:
Cytochrome P450 1B1
Synonyms:
CP1B1_HUMAN CYPIB1 | Cytochrome P450 1B1 (CYP1B1)
Type:
PROTEIN
Mol. Mass.:
60861.81
Organism:
Homo sapiens (Human)
Description:
ChEMBL_1474523
Residue:
543
  
Inhibitor
Name:
BDBM50247272
Synonyms:
5-(4-fluorostyryl)benzene-1,3-diol Stilbene, 8f
Type:
Small organic molecule
Emp. Form.:
C14H11FO2
Mol. Mass.:
230.2343
SMILES:
Oc1cc(O)cc(\C=C\c2ccc(F)cc2)c1
: