Target
G-protein coupled receptor 35
Ligand
BDBM68315
Substrate
Meas. Tech.
SAR analysis of Antagonists of the GPR35 Receptor using an Image-Based Assay - Set 4
IC50
>32000±n/a nM
Citation
 PubChem, PC SAR analysis of Antagonists of the GPR35 Receptor using an Image-Based Assay - Set 4 PubChem Bioassay (2010)[AID] 
Target
Name:
G-protein coupled receptor 35
Synonyms:
G protein-coupled receptor 35 GPR35_HUMAN
Type:
Enzyme Catalytic Domain
Mol. Mass.:
34085.57
Organism:
Homo sapiens (Human)
Description:
gi_33695097
Residue:
309
  
Inhibitor
Name:
BDBM68315
Synonyms:
MLS-0435541.0001 N-(5-morpholin-4-ylsulfonyl-2-pyrrolidin-1-ylphenyl)-4,5,6,7-tetrahydro-1-benzothiophene-2-carboxamide N-[5-(4-morpholinylsulfonyl)-2-(1-pyrrolidinyl)phenyl]-4,5,6,7-tetrahydro-1-benzothiophene-2-carboxamide | cid_17460708
Type:
Small organic molecule
Emp. Form.:
C23H29N3O4S2
Mol. Mass.:
475.624
SMILES:
O=C(Nc1cc(ccc1N1CCCC1)S(=O)(=O)N1CCOCC1)c1cc2CCCCc2s1
: