Target
Cannabinoid receptor 2
Ligand
BDBM68299
Substrate
Meas. Tech.
SAR analysis of agonists of the Cannabinoid Receptor 2 using an Image-Based Assay - Set 2
EC50
>32000±n/a nM
Citation
 PubChem, PC SAR analysis of agonists of the Cannabinoid Receptor 2 using an Image-Based Assay - Set 2 PubChem Bioassay (2010)[AID] 
Target
Name:
Cannabinoid receptor 2
Synonyms:
CANNABINOID CB2 CB2 CB2B CNR2_HUMAN Cannabinoid CB2 receptor Cannabinoid receptor 2 (CB2R) | hCB2
Type:
G Protein-Coupled Receptor (GPCR)
Mol. Mass.:
39690.94
Organism:
Homo sapiens (Human)
Description:
P34972
Residue:
360
  
Inhibitor
Name:
BDBM68299
Synonyms:
MLS-0435528.0001 N,N-dimethyl-3-(4-phenylpiperazine-1-carbonyl)-4-pyrrolidin-1-ylbenzenesulfonamide N,N-dimethyl-3-[oxo-(4-phenyl-1-piperazinyl)methyl]-4-(1-pyrrolidinyl)benzenesulfonamide | cid_2466259
Type:
Small organic molecule
Emp. Form.:
C23H30N4O3S
Mol. Mass.:
442.574
SMILES:
CN(C)S(=O)(=O)c1ccc(N2CCCC2)c(c1)C(=O)N1CCN(CC1)c1ccccc1
: