Target
ATP-dependent molecular chaperone HSP82
Ligand
BDBM58327
Substrate
Meas. Tech.
Luminescence Cell-Based Secondary Assay to Identify Inhibitors of Hsp90
EC50
65190±n/a nM
Citation
 PubChem, PC Luminescence Cell-Based Secondary Assay to Identify Inhibitors of Hsp90 PubChem Bioassay (2010)[AID] 
Target
Name:
ATP-dependent molecular chaperone HSP82
Synonyms:
heat shock protein 90
Type:
Enzyme Catalytic Domain
Mol. Mass.:
80784.12
Organism:
Candida albicans
Description:
gi_994798
Residue:
707
  
Inhibitor
Name:
BDBM58327
Synonyms:
MLS001204085 N-[(4-chlorophenyl)-(8-hydroxy-7-quinolinyl)methyl]butanamide N-[(4-chlorophenyl)-(8-hydroxyquinolin-7-yl)methyl]butanamide SMR000516562 | cid_2876611
Type:
Small organic molecule
Emp. Form.:
C20H19ClN2O2
Mol. Mass.:
354.83
SMILES:
CCCC(=O)NC(c1ccc(Cl)cc1)c1ccc2cccnc2c1O
: