Target
ATP-dependent molecular chaperone HSP82
Ligand
BDBM64595
Substrate
Meas. Tech.
Luminescence Cell-Based Secondary Assay to Identify Inhibitors of Hsp90
EC50
15080±n/a nM
Citation
 PubChem, PC Luminescence Cell-Based Secondary Assay to Identify Inhibitors of Hsp90 PubChem Bioassay (2010)[AID] 
Target
Name:
ATP-dependent molecular chaperone HSP82
Synonyms:
heat shock protein 90
Type:
Enzyme Catalytic Domain
Mol. Mass.:
80784.12
Organism:
Candida albicans
Description:
gi_994798
Residue:
707
  
Inhibitor
Name:
BDBM64595
Synonyms:
MLS000555416 N-[3-(4-chlorobenzoyl)-4,5,6,7-tetrahydro-1-benzothiophen-2-yl]pyridine-3-carboxamide N-[3-(4-chlorophenyl)carbonyl-4,5,6,7-tetrahydro-1-benzothiophen-2-yl]pyridine-3-carboxamide SMR000177109 | cid_3134270
Type:
Small organic molecule
Emp. Form.:
C21H17ClN2O2S
Mol. Mass.:
396.89
SMILES:
Clc1ccc(cc1)C(=O)c1c(NC(=O)c2cccnc2)sc2CCCCc12
: