Target
S-ribosylhomocysteine lyase
Ligand
BDBM65980
Substrate
Meas. Tech.
Luminescence Cell-Free Homogeneous Dose Response to Identify Inhibitors of Lux-S
EC50
>350000±n/a nM
Citation
 PubChem, PC Luminescence Cell-Free Homogeneous Dose Response to Identify Inhibitors of Lux-S PubChem Bioassay (2010)[AID] 
Target
Name:
S-ribosylhomocysteine lyase
Synonyms:
LuxS
Type:
Enzyme Catalytic Domain
Mol. Mass.:
15564.06
Organism:
Vibrio harveyi
Description:
B0LUE4
Residue:
140
  
Inhibitor
Name:
BDBM65980
Synonyms:
MLS001211346 N-(5-bromanylpyridin-2-yl)-4-ethyl-benzenesulfonamide N-(5-bromo-2-pyridyl)-4-ethyl-benzenesulfonamide SMR000516778 | cid_766689
Type:
Small organic molecule
Emp. Form.:
C13H13BrN2O2S
Mol. Mass.:
341.224
SMILES:
CCc1ccc(cc1)S(=O)(=O)Nc1ccc(Br)cn1
: