Target
Serine/threonine-protein phosphatase
Ligand
BDBM68334
Substrate
Meas. Tech.
Fluorescence Cell-Based Secondary Assay to Identify Inhibitors of Calcineurin
EC50
>285000±n/a nM
Citation
 PubChem, PC Fluorescence Cell-Based Secondary Assay to Identify Inhibitors of Calcineurin PubChem Bioassay (2010)[AID] 
Target
Name:
Serine/threonine-protein phosphatase
Synonyms:
calcineurin A1, putative serine/threonine-protein phosphatase 2B catalytic subunit A1, putative
Type:
Enzyme Catalytic Domain
Mol. Mass.:
69558.03
Organism:
Candida dubliniensis CD36
Description:
gi_223640082
Residue:
607
  
Inhibitor
Name:
BDBM68334
Synonyms:
3-amino-N-[5-[(4-chlorobenzyl)thio]-1,3,4-thiadiazol-2-yl]pyrazinamide 3-amino-N-[5-[(4-chlorophenyl)methylthio]-1,3,4-thiadiazol-2-yl]-2-pyrazinecarboxamide BRD-K38089706-001-01-9 | cid_25475077
Type:
Small organic molecule
Emp. Form.:
C14H11ClN6OS2
Mol. Mass.:
378.86
SMILES:
Nc1nccnc1C(=O)Nc1nnc(SCc2ccc(Cl)cc2)s1
: