Target
Serine/threonine-protein phosphatase
Ligand
BDBM64598
Substrate
Meas. Tech.
Fluorescence Cell-Based Secondary Assay to Identify Inhibitors of Calcineurin
EC50
17270±n/a nM
Citation
 PubChem, PC Fluorescence Cell-Based Secondary Assay to Identify Inhibitors of Calcineurin PubChem Bioassay (2010)[AID] 
Target
Name:
Serine/threonine-protein phosphatase
Synonyms:
calcineurin A1, putative serine/threonine-protein phosphatase 2B catalytic subunit A1, putative
Type:
Enzyme Catalytic Domain
Mol. Mass.:
69558.03
Organism:
Candida dubliniensis CD36
Description:
gi_223640082
Residue:
607
  
Inhibitor
Name:
BDBM64598
Synonyms:
6-bromanyl-3-oxidanyl-2-[3-(trifluoromethyl)phenyl]quinazolin-4-one 6-bromo-3-hydroxy-2-[3-(trifluoromethyl)phenyl]-4-quinazolinone MLS000326257 cid_1487353
Type:
Small organic molecule
Emp. Form.:
C15H8BrF3N2O2
Mol. Mass.:
385.135
SMILES:
On1c(nc2ccc(Br)cc2c1=O)-c1cccc(c1)C(F)(F)F
: