Target
Serine/threonine-protein phosphatase
Ligand
BDBM64595
Substrate
Meas. Tech.
Fluorescence Cell-Based Secondary Assay to Identify Inhibitors of Calcineurin
EC50
27640±n/a nM
Citation
 PubChem, PC Fluorescence Cell-Based Secondary Assay to Identify Inhibitors of Calcineurin PubChem Bioassay (2010)[AID] 
Target
Name:
Serine/threonine-protein phosphatase
Synonyms:
calcineurin A1, putative serine/threonine-protein phosphatase 2B catalytic subunit A1, putative
Type:
Enzyme Catalytic Domain
Mol. Mass.:
69558.03
Organism:
Candida dubliniensis CD36
Description:
gi_223640082
Residue:
607
  
Inhibitor
Name:
BDBM64595
Synonyms:
MLS000555416 N-[3-(4-chlorobenzoyl)-4,5,6,7-tetrahydro-1-benzothiophen-2-yl]pyridine-3-carboxamide N-[3-(4-chlorophenyl)carbonyl-4,5,6,7-tetrahydro-1-benzothiophen-2-yl]pyridine-3-carboxamide SMR000177109 | cid_3134270
Type:
Small organic molecule
Emp. Form.:
C21H17ClN2O2S
Mol. Mass.:
396.89
SMILES:
Clc1ccc(cc1)C(=O)c1c(NC(=O)c2cccnc2)sc2CCCCc12
: