Target
Glycogen synthase kinase-3 beta
Ligand
BDBM68375
Substrate
Meas. Tech.
Luminescence Cell-Free Homogeneous Dose Retest to Identify Inhibitors of Glycogen Synthase Kinase-3 beta Activity
EC50
>300000±n/a nM
Citation
 PubChem, PC Luminescence Cell-Free Homogeneous Dose Retest to Identify Inhibitors of Glycogen Synthase Kinase-3 beta Activity PubChem Bioassay (2010)[AID] 
Target
Name:
Glycogen synthase kinase-3 beta
Synonyms:
GSK-3 beta GSK3B Glycogen synthase kinase 3 beta (GSK3B) Glycogen synthase kinase-3 beta (GSK-3B) Glycogen synthase kinase-3 beta (GSK3B) Glycogen synthase kinase-3beta (GSK3B) | Serine/threonine-protein kinase GSK3B
Type:
Enzyme
Mol. Mass.:
46756.38
Organism:
Homo sapiens (Human)
Description:
P49841
Residue:
420
  
Inhibitor
Name:
BDBM68375
Synonyms:
4-[4-(3,4-Dimethoxy-phenyl)-thiazol-2-yl]-morpholine 4-[4-(3,4-dimethoxyphenyl)-2-thiazolyl]morpholine MLS000072749 cid_653894
Type:
Small organic molecule
Emp. Form.:
C15H18N2O3S
Mol. Mass.:
306.38
SMILES:
COc1ccc(cc1OC)-c1csc(n1)N1CCOCC1
: