Target
Glycogen synthase kinase-3 beta
Ligand
BDBM68409
Substrate
Meas. Tech.
Luminescence Cell-Free Homogeneous Dose Retest to Identify Inhibitors of Glycogen Synthase Kinase-3 beta Activity
EC50
>300000±n/a nM
Citation
 PubChem, PC Luminescence Cell-Free Homogeneous Dose Retest to Identify Inhibitors of Glycogen Synthase Kinase-3 beta Activity PubChem Bioassay (2010)[AID] 
Target
Name:
Glycogen synthase kinase-3 beta
Synonyms:
GSK-3 beta GSK3B Glycogen synthase kinase 3 beta (GSK3B) Glycogen synthase kinase-3 beta (GSK-3B) Glycogen synthase kinase-3 beta (GSK3B) Glycogen synthase kinase-3beta (GSK3B) | Serine/threonine-protein kinase GSK3B
Type:
Enzyme
Mol. Mass.:
46756.38
Organism:
Homo sapiens (Human)
Description:
P49841
Residue:
420
  
Inhibitor
Name:
BDBM68409
Synonyms:
2-(3-cyano-6-pyridin-3-yl-pyridin-2-yl)sulfanyl-N-(5-methyl-1,2-oxazol-3-yl)ethanamide 2-[[3-cyano-6-(3-pyridinyl)-2-pyridinyl]thio]-N-(5-methyl-3-isoxazolyl)acetamide MLS000036936 cid_660561
Type:
Small organic molecule
Emp. Form.:
C17H13N5O2S
Mol. Mass.:
351.382
SMILES:
Cc1cc(NC(=O)CSc2nc(ccc2C#N)-c2cccnc2)no1
: