Target
Glycogen synthase kinase-3 beta
Ligand
BDBM68482
Substrate
Meas. Tech.
Luminescence Cell-Free Homogeneous Dose Retest to Identify Inhibitors of Glycogen Synthase Kinase-3 beta Activity
EC50
10890±n/a nM
Citation
 PubChem, PC Luminescence Cell-Free Homogeneous Dose Retest to Identify Inhibitors of Glycogen Synthase Kinase-3 beta Activity PubChem Bioassay (2010)[AID] 
Target
Name:
Glycogen synthase kinase-3 beta
Synonyms:
GSK-3 beta GSK3B Glycogen synthase kinase 3 beta (GSK3B) Glycogen synthase kinase-3 beta (GSK-3B) Glycogen synthase kinase-3 beta (GSK3B) Glycogen synthase kinase-3beta (GSK3B) | Serine/threonine-protein kinase GSK3B
Type:
Enzyme
Mol. Mass.:
46756.38
Organism:
Homo sapiens (Human)
Description:
P49841
Residue:
420
  
Inhibitor
Name:
BDBM68482
Synonyms:
2-phenoxyethyl 3-methyl-4-oxidanylidene-1,5,6,7-tetrahydroindole-2-carboxylate 2-phenoxyethyl 3-methyl-4-oxo-4,5,6,7-tetrahydro-1H-indole-2-carboxylate 4-keto-3-methyl-1,5,6,7-tetrahydroindole-2-carboxylic acid 2-phenoxyethyl ester SMR000025504 | cid_3237617
Type:
Small organic molecule
Emp. Form.:
C18H19NO4
Mol. Mass.:
313.3478
SMILES:
Cc1c([nH]c2CCCC(=O)c12)C(=O)OCCOc1ccccc1
: