Target
Glycogen synthase kinase-3 beta
Ligand
BDBM68526
Substrate
Meas. Tech.
Luminescence Cell-Free Homogeneous Dose Retest to Identify Inhibitors of Glycogen Synthase Kinase-3 beta Activity
EC50
>300000±n/a nM
Citation
 PubChem, PC Luminescence Cell-Free Homogeneous Dose Retest to Identify Inhibitors of Glycogen Synthase Kinase-3 beta Activity PubChem Bioassay (2010)[AID] 
Target
Name:
Glycogen synthase kinase-3 beta
Synonyms:
GSK-3 beta GSK3B Glycogen synthase kinase 3 beta (GSK3B) Glycogen synthase kinase-3 beta (GSK-3B) Glycogen synthase kinase-3 beta (GSK3B) Glycogen synthase kinase-3beta (GSK3B) | Serine/threonine-protein kinase GSK3B
Type:
Enzyme
Mol. Mass.:
46756.38
Organism:
Homo sapiens (Human)
Description:
P49841
Residue:
420
  
Inhibitor
Name:
BDBM68526
Synonyms:
2,2'-bipyridine-3,3'-dicarboxylic acid 2-(3-carboxy-2-pyridyl)nicotinic acid MLS000085982 cid_681885
Type:
Small organic molecule
Emp. Form.:
C12H8N2O4
Mol. Mass.:
244.2029
SMILES:
OC(=O)c1cccnc1-c1ncccc1C(O)=O
: