Target
Glycogen synthase kinase-3 beta
Ligand
BDBM68554
Substrate
Meas. Tech.
Luminescence Cell-Free Homogeneous Dose Retest to Identify Inhibitors of Glycogen Synthase Kinase-3 beta Activity
EC50
>300000±n/a nM
Citation
 PubChem, PC Luminescence Cell-Free Homogeneous Dose Retest to Identify Inhibitors of Glycogen Synthase Kinase-3 beta Activity PubChem Bioassay (2010)[AID] 
Target
Name:
Glycogen synthase kinase-3 beta
Synonyms:
GSK-3 beta GSK3B Glycogen synthase kinase 3 beta (GSK3B) Glycogen synthase kinase-3 beta (GSK-3B) Glycogen synthase kinase-3 beta (GSK3B) Glycogen synthase kinase-3beta (GSK3B) | Serine/threonine-protein kinase GSK3B
Type:
Enzyme
Mol. Mass.:
46756.38
Organism:
Homo sapiens (Human)
Description:
P49841
Residue:
420
  
Inhibitor
Name:
BDBM68554
Synonyms:
2-(ethylthio)-4-hydroxy-6-phenyl-5-pyrimidinecarbonitrile 2-(ethylthio)-4-oxo-6-phenyl-1H-pyrimidine-5-carbonitrile 2-ethylsulfanyl-4-oxo-6-phenyl-1H-pyrimidine-5-carbonitrile SMR000073082 | cid_892085
Type:
Small organic molecule
Emp. Form.:
C13H11N3OS
Mol. Mass.:
257.311
SMILES:
CCSc1nc(-c2ccccc2)c(C#N)c(=O)[nH]1
: