Target
Glycogen synthase kinase-3 beta
Ligand
BDBM50154375
Substrate
Meas. Tech.
Luminescence Cell-Free Homogeneous Dose Retest to Identify Inhibitors of Glycogen Synthase Kinase-3 beta Activity
EC50
>300000±n/a nM
Citation
 PubChem, PC Luminescence Cell-Free Homogeneous Dose Retest to Identify Inhibitors of Glycogen Synthase Kinase-3 beta Activity PubChem Bioassay (2010)[AID] 
Target
Name:
Glycogen synthase kinase-3 beta
Synonyms:
GSK-3 beta GSK3B Glycogen synthase kinase 3 beta (GSK3B) Glycogen synthase kinase-3 beta (GSK-3B) Glycogen synthase kinase-3 beta (GSK3B) Glycogen synthase kinase-3beta (GSK3B) | Serine/threonine-protein kinase GSK3B
Type:
Enzyme
Mol. Mass.:
46756.38
Organism:
Homo sapiens (Human)
Description:
P49841
Residue:
420
  
Inhibitor
Name:
BDBM50154375
Synonyms:
Adenosine receptor agonist, 16 Tribavirin med.21724, Compound 180
Type:
Small organic molecule
Emp. Form.:
C8H12N4O5
Mol. Mass.:
244.2047
SMILES:
NC(=O)c1ncn(n1)[C@@H]1O[C@H](CO)[C@@H](O)[C@H]1O
: