Target
Glycogen synthase kinase-3 beta
Ligand
BDBM50000298
Substrate
Meas. Tech.
Luminescence Cell-Free Homogeneous Dose Retest to Identify Inhibitors of Glycogen Synthase Kinase-3 beta Activity
EC50
>300000±n/a nM
Citation
 PubChem, PC Luminescence Cell-Free Homogeneous Dose Retest to Identify Inhibitors of Glycogen Synthase Kinase-3 beta Activity PubChem Bioassay (2010)[AID] 
Target
Name:
Glycogen synthase kinase-3 beta
Synonyms:
GSK-3 beta GSK3B Glycogen synthase kinase 3 beta (GSK3B) Glycogen synthase kinase-3 beta (GSK-3B) Glycogen synthase kinase-3 beta (GSK3B) Glycogen synthase kinase-3beta (GSK3B) | Serine/threonine-protein kinase GSK3B
Type:
Enzyme
Mol. Mass.:
46756.38
Organism:
Homo sapiens (Human)
Description:
P49841
Residue:
420
  
Inhibitor
Name:
BDBM50000298
Synonyms:
'2-(4-AMINO-PYRROLO[2,3-D]PYRIMIDIN-7-YL)-5-HYDROXYMETHYL-TETRAHYDRO-FURAN-3,4-DIOL 2-(4-Amino-pyrrolo[2,3-d]pyrimidin-7-yl)-5-hydroxymethyl-tetrahydro-furan-3,4-diol 2-(4-Amino-pyrrolo[2,3-d]pyrimidin-7-yl)-5-hydroxymethyl-tetrahydro-furan-3,4-diol(tubercidin) TUBERCIDIN | cid_6245
Type:
Small organic molecule
Emp. Form.:
C11H14N4O4
Mol. Mass.:
266.2533
SMILES:
Nc1ncnc2n(ccc12)[C@@H]1O[C@H](CO)[C@@H](O)[C@H]1O
: