Target
Protein RecA
Ligand
BDBM59619
Substrate
Meas. Tech.
Fluorescence Cell-Free Homogeneous Counter Screen to Identify Inhibitors of GFP Chromophore Formation
EC50
>380000±n/a nM
Citation
 PubChem, PC Fluorescence Cell-Free Homogeneous Counter Screen to Identify Inhibitors of GFP Chromophore Formation PubChem Bioassay (2010)[AID] 
Target
Name:
Protein RecA
Synonyms:
DNA recombination protein RecA recA
Type:
Enzyme Catalytic Domain
Mol. Mass.:
85386.52
Organism:
Mycobacterium tuberculosis H37Rv
Description:
gi_15609874
Residue:
790
  
Inhibitor
Name:
BDBM59619
Synonyms:
(2S)-3-methyl-2-[(4-phenoxyphenyl)carbamoylamino]butanoic acid (2S)-3-methyl-2-[[oxo-(4-phenoxyanilino)methyl]amino]butanoic acid SMR000045190 | cid_664391
Type:
Small organic molecule
Emp. Form.:
C18H20N2O4
Mol. Mass.:
328.3624
SMILES:
CC(C)[C@H](NC(=O)Nc1ccc(Oc2ccccc2)cc1)C(O)=O
: