Target
Protein RecA
Ligand
BDBM70365
Substrate
Meas. Tech.
Fluorescence Cell-Free Homogeneous Counter Screen to Identify Inhibitors of GFP Chromophore Formation
EC50
7058±n/a nM
Citation
 PubChem, PC Fluorescence Cell-Free Homogeneous Counter Screen to Identify Inhibitors of GFP Chromophore Formation PubChem Bioassay (2010)[AID] 
Target
Name:
Protein RecA
Synonyms:
DNA recombination protein RecA recA
Type:
Enzyme Catalytic Domain
Mol. Mass.:
85386.52
Organism:
Mycobacterium tuberculosis H37Rv
Description:
gi_15609874
Residue:
790
  
Inhibitor
Name:
BDBM70365
Synonyms:
6-amino-4-[3-(4-fluorophenyl)-1H-pyrazol-4-yl]-3-propyl-1,4-dihydropyrano[2,3-c]pyrazole-5-carbonitrile 6-azanyl-4-[5-(4-fluorophenyl)-1H-pyrazol-4-yl]-3-propyl-2,4-dihydropyrano[2,3-c]pyrazole-5-carbonitrile SMR000024986 | cid_3239433
Type:
Small organic molecule
Emp. Form.:
C19H17FN6O
Mol. Mass.:
364.3763
SMILES:
CCCc1[nH]nc2OC(=N)C(C#N)C(c3c[nH]nc3-c3ccc(F)cc3)c12
: