Target
Amyloid-beta A4 precursor protein-binding family A member 1
Ligand
BDBM65787
Substrate
Meas. Tech.
SAR analysis of small molecule inhibitors of Mint-PDZ and N-type Ca2+ channel carboxyl-terminal peptide association using HTRF - Set 2
IC50
>56800±n/a nM
Citation
 PubChem, PC SAR analysis of small molecule inhibitors of Mint-PDZ and N-type Ca2+ channel carboxyl-terminal peptide association using HTRF - Set 2 PubChem Bioassay (2010)[AID] 
Target
Name:
Amyloid-beta A4 precursor protein-binding family A member 1
Synonyms:
APBA1_RAT Mint1 neuronal munc18-1 binding protein
Type:
Enzyme Catalytic Domain
Mol. Mass.:
92603.32
Organism:
Rattus norvegicus
Description:
gi_2625023
Residue:
839
  
Inhibitor
Name:
BDBM65787
Synonyms:
2-(2-furanyl)-N-[2-(3-methoxyphenyl)ethyl]-4-quinolinecarboxamide 2-(furan-2-yl)-N-[2-(3-methoxyphenyl)ethyl]quinoline-4-carboxamide cid_44602304
Type:
Small organic molecule
Emp. Form.:
C23H20N2O3
Mol. Mass.:
372.4165
SMILES:
COc1cccc(CCNC(=O)c2cc(nc3ccccc23)-c2ccco2)c1
: