Target
Amyloid-beta A4 precursor protein-binding family A member 1
Ligand
BDBM71551
Substrate
Meas. Tech.
SAR analysis of small molecule inhibitors of Mint-PDZ and N-type Ca2+ channel carboxyl-terminal peptide association using HTRF - Set 2
IC50
46400±n/a nM
Citation
 PubChem, PC SAR analysis of small molecule inhibitors of Mint-PDZ and N-type Ca2+ channel carboxyl-terminal peptide association using HTRF - Set 2 PubChem Bioassay (2010)[AID] 
Target
Name:
Amyloid-beta A4 precursor protein-binding family A member 1
Synonyms:
APBA1_RAT Mint1 neuronal munc18-1 binding protein
Type:
Enzyme Catalytic Domain
Mol. Mass.:
92603.32
Organism:
Rattus norvegicus
Description:
gi_2625023
Residue:
839
  
Inhibitor
Name:
BDBM71551
Synonyms:
2-(2-furanyl)-N-[(1R,2S)-2-phenylcyclopropyl]-4-quinolinecarboxamide 2-(furan-2-yl)-N-[(1R,2S)-2-phenylcyclopropyl]quinoline-4-carboxamide cid_44631795
Type:
Small organic molecule
Emp. Form.:
C23H18N2O2
Mol. Mass.:
354.4012
SMILES:
O=C(N[C@@H]1C[C@H]1c1ccccc1)c1cc(nc2ccccc12)-c1ccco1
: