Target
NADPH oxidase 1
Ligand
BDBM65842
Substrate
Meas. Tech.
Late stage results from the probe development effort to identify inhibitors of NOX1: HEK/293 IC50 Set 2
IC50
960±n/a nM
Citation
 PubChem, PC Late stage results from the probe development effort to identify inhibitors of NOX1: HEK/293 IC50 Set 2 PubChem Bioassay (2010)[AID] 
Target
Name:
NADPH oxidase 1
Synonyms:
MOX-1 Mitogenic oxidase 1 NOH-1 NOX-1 NOX1_HUMAN
Type:
PROTEIN
Mol. Mass.:
64890.44
Organism:
Homo sapiens (Human)
Description:
ChEMBL_792877
Residue:
564
  
Inhibitor
Name:
BDBM65842
Synonyms:
1-(4-chloranyl-2-methyl-phenyl)-3-[(4-fluorophenyl)carbamothioylamino]thiourea 1-(4-chloro-2-methylphenyl)-3-[(4-fluorophenyl)carbamothioylamino]thiourea SR-01000642617-1 | cid_2725211
Type:
Small organic molecule
Emp. Form.:
C15H14ClFN4S2
Mol. Mass.:
368.88
SMILES:
Cc1cc(Cl)ccc1NC(=S)NNC(=S)Nc1ccc(F)cc1
: