Target
Heat shock factor protein 1
Ligand
BDBM71804
Substrate
Meas. Tech.
Luminescence Cell-Based Dose Retest to Identify Potentiators of Heat Shock Factor 1 (HSF1)
EC50
>260000±n/a nM
Citation
 PubChem, PC Luminescence Cell-Based Dose Retest to Identify Potentiators of Heat Shock Factor 1 (HSF1) PubChem Bioassay (2010)[AID] 
Target
Name:
Heat shock factor protein 1
Synonyms:
HSF1_MOUSE Hsf1 protein
Type:
Enzyme Catalytic Domain
Mol. Mass.:
57208.68
Organism:
Mus musculus
Description:
P38532
Residue:
525
  
Inhibitor
Name:
BDBM71804
Synonyms:
2-(4-chloranylphenoxy)-2-methyl-N-(2-pyridin-4-yl-1,3-benzoxazol-5-yl)propanamide 2-(4-chlorophenoxy)-2-methyl-N-[2-(4-pyridinyl)-1,3-benzoxazol-5-yl]propanamide MLS000052574 cid_1256741
Type:
Small organic molecule
Emp. Form.:
C22H18ClN3O3
Mol. Mass.:
407.85
SMILES:
CC(C)(Oc1ccc(Cl)cc1)C(=O)Nc1ccc2oc(nc2c1)-c1ccncc1
: