Target
NADPH oxidase 1
Ligand
BDBM67476
Substrate
Meas. Tech.
Late stage results from the probe development effort to identify inhibitors of (NADPH oxidase 1) NOX1: Xanthine Oxidase Set 2
IC50
1200±n/a nM
Citation
 PubChem, PC Late stage results from the probe development effort to identify inhibitors of (NADPH oxidase 1) NOX1: Xanthine Oxidase Set 2 PubChem Bioassay (2010)[AID] 
Target
Name:
NADPH oxidase 1
Synonyms:
MOX-1 Mitogenic oxidase 1 NOH-1 NOX-1 NOX1_HUMAN
Type:
PROTEIN
Mol. Mass.:
64890.44
Organism:
Homo sapiens (Human)
Description:
ChEMBL_792877
Residue:
564
  
Inhibitor
Name:
BDBM67476
Synonyms:
1-[4-(dimethylamino)phenyl]-3-(4-methylsulfanylphenyl)urea SR-03000000697-1 | cid_4097542
Type:
Small organic molecule
Emp. Form.:
C16H19N3OS
Mol. Mass.:
301.407
SMILES:
CSc1ccc(NC(=O)Nc2ccc(cc2)N(C)C)cc1
: