Target
Protein RecA
Ligand
BDBM70242
Substrate
Meas. Tech.
Fluorescence Cell-Free Homogeneous Dose Retest to Identify Inhibitors of RecA-Intein Splicing Activity
EC50
9010±n/a nM
Citation
 PubChem, PC Fluorescence Cell-Free Homogeneous Dose Retest to Identify Inhibitors of RecA-Intein Splicing Activity PubChem Bioassay (2010)[AID] 
Target
Name:
Protein RecA
Synonyms:
DNA recombination protein RecA recA
Type:
Enzyme Catalytic Domain
Mol. Mass.:
85386.52
Organism:
Mycobacterium tuberculosis H37Rv
Description:
gi_15609874
Residue:
790
  
Inhibitor
Name:
BDBM70242
Synonyms:
6-Amino-4-(2-ethoxy-phenyl)-3-propyl-1,4-dihydro-pyrano[2,3-c]pyrazole-5-carbonitrile 6-amino-4-o-phenetyl-3-propyl-2,4-dihydropyrano[2,3-c]pyrazole-5-carbonitrile MLS000075246 cid_644905
Type:
Small organic molecule
Emp. Form.:
C18H20N4O2
Mol. Mass.:
324.377
SMILES:
CCCc1[nH]nc2OC(=N)C(C#N)C(c12)c1ccccc1OCC
: