Target
Protein RecA
Ligand
BDBM70266
Substrate
Meas. Tech.
Fluorescence Cell-Free Homogeneous Dose Retest to Identify Inhibitors of RecA-Intein Splicing Activity
EC50
845±n/a nM
Citation
 PubChem, PC Fluorescence Cell-Free Homogeneous Dose Retest to Identify Inhibitors of RecA-Intein Splicing Activity PubChem Bioassay (2010)[AID] 
Target
Name:
Protein RecA
Synonyms:
DNA recombination protein RecA recA
Type:
Enzyme Catalytic Domain
Mol. Mass.:
85386.52
Organism:
Mycobacterium tuberculosis H37Rv
Description:
gi_15609874
Residue:
790
  
Inhibitor
Name:
BDBM70266
Synonyms:
(3-Ethoxycarbonylmethylsulfanyl-5-oxo-2,5-dihydro-[1,2,4]triazin-6-ylamino)-acetic acid ethyl ester 2-[[3-[(2-ethoxy-2-oxoethyl)thio]-5-oxo-2H-1,2,4-triazin-6-yl]amino]acetic acid ethyl ester SMR000009169 ethyl 2-[[3-(2-ethoxy-2-oxidanylidene-ethyl)sulfanyl-5-oxidanylidene-2H-1,2,4-triazin-6-yl]amino]ethanoate | ethyl 2-[[3-(2-ethoxy-2-oxoethyl)sulfanyl-5-oxo-2H-1,2,4-triazin-6-yl]amino]acetate
Type:
Small organic molecule
Emp. Form.:
C11H16N4O5S
Mol. Mass.:
316.334
SMILES:
CCOC(=O)CNc1nnc(SCC(=O)OCC)[nH]c1=O
: