Target
Protein RecA
Ligand
BDBM70313
Substrate
Meas. Tech.
Fluorescence Cell-Free Homogeneous Dose Retest to Identify Inhibitors of RecA-Intein Splicing Activity
EC50
1460±n/a nM
Citation
 PubChem, PC Fluorescence Cell-Free Homogeneous Dose Retest to Identify Inhibitors of RecA-Intein Splicing Activity PubChem Bioassay (2010)[AID] 
Target
Name:
Protein RecA
Synonyms:
DNA recombination protein RecA recA
Type:
Enzyme Catalytic Domain
Mol. Mass.:
85386.52
Organism:
Mycobacterium tuberculosis H37Rv
Description:
gi_15609874
Residue:
790
  
Inhibitor
Name:
BDBM70313
Synonyms:
(3-amino-1,2,4-triazol-1-yl)-(4-hexoxyphenyl)methanone MLS000079346 cid_659941
Type:
Small organic molecule
Emp. Form.:
C15H20N4O2
Mol. Mass.:
288.3449
SMILES:
CCCCCCOc1ccc(cc1)C(=O)n1cnc(N)n1
: