Target
Protein RecA
Ligand
BDBM70332
Substrate
Meas. Tech.
Fluorescence Cell-Free Homogeneous Dose Retest to Identify Inhibitors of RecA-Intein Splicing Activity
EC50
>380000±n/a nM
Citation
 PubChem, PC Fluorescence Cell-Free Homogeneous Dose Retest to Identify Inhibitors of RecA-Intein Splicing Activity PubChem Bioassay (2010)[AID] 
Target
Name:
Protein RecA
Synonyms:
DNA recombination protein RecA recA
Type:
Enzyme Catalytic Domain
Mol. Mass.:
85386.52
Organism:
Mycobacterium tuberculosis H37Rv
Description:
gi_15609874
Residue:
790
  
Inhibitor
Name:
BDBM70332
Synonyms:
2-(3-methylphenyl)sulfonyl-2-(3-pyrrolidin-1-ylquinoxalin-2-yl)acetonitrile 2-(3-methylphenyl)sulfonyl-2-[3-(1-pyrrolidinyl)-2-quinoxalinyl]acetonitrile MLS000041906 cid_664808
Type:
Small organic molecule
Emp. Form.:
C21H20N4O2S
Mol. Mass.:
392.474
SMILES:
Cc1cccc(c1)S(=O)(=O)C(C#N)c1nc2ccccc2nc1N1CCCC1
: