Target
Protein RecA
Ligand
BDBM32778
Substrate
Meas. Tech.
Fluorescence Cell-Free Homogeneous Dose Retest to Identify Inhibitors of RecA-Intein Splicing Activity
EC50
2670±n/a nM
Citation
 PubChem, PC Fluorescence Cell-Free Homogeneous Dose Retest to Identify Inhibitors of RecA-Intein Splicing Activity PubChem Bioassay (2010)[AID] 
Target
Name:
Protein RecA
Synonyms:
DNA recombination protein RecA recA
Type:
Enzyme Catalytic Domain
Mol. Mass.:
85386.52
Organism:
Mycobacterium tuberculosis H37Rv
Description:
gi_15609874
Residue:
790
  
Inhibitor
Name:
BDBM32778
Synonyms:
MLS000081703 [2-(2-cyanoethyl)-5-methyl-pyrazol-3-yl] benzoate benzoic acid [2-(2-cyanoethyl)-5-methyl-3-pyrazolyl] ester cid_2366780
Type:
Small organic molecule
Emp. Form.:
C14H13N3O2
Mol. Mass.:
255.2719
SMILES:
Cc1cc(OC(=O)c2ccccc2)n(CCC#N)n1
: