Target
Protein RecA
Ligand
BDBM70351
Substrate
Meas. Tech.
Fluorescence Cell-Free Homogeneous Dose Retest to Identify Inhibitors of RecA-Intein Splicing Activity
EC50
10100±n/a nM
Citation
 PubChem, PC Fluorescence Cell-Free Homogeneous Dose Retest to Identify Inhibitors of RecA-Intein Splicing Activity PubChem Bioassay (2010)[AID] 
Target
Name:
Protein RecA
Synonyms:
DNA recombination protein RecA recA
Type:
Enzyme Catalytic Domain
Mol. Mass.:
85386.52
Organism:
Mycobacterium tuberculosis H37Rv
Description:
gi_15609874
Residue:
790
  
Inhibitor
Name:
BDBM70351
Synonyms:
2-furancarboxylic acid [3-[[2-furanyl(oxo)methyl]amino]phenyl] ester MLS000084726 [3-(furan-2-carbonylamino)phenyl] furan-2-carboxylate cid_3237618 | furan-2-carboxylic acid [3-(2-furoylamino)phenyl] ester
Type:
Small organic molecule
Emp. Form.:
C16H11NO5
Mol. Mass.:
297.2622
SMILES:
O=C(Nc1cccc(OC(=O)c2ccco2)c1)c1ccco1
: