Target
Protein RecA
Ligand
BDBM70355
Substrate
Meas. Tech.
Fluorescence Cell-Free Homogeneous Dose Retest to Identify Inhibitors of RecA-Intein Splicing Activity
EC50
1180±n/a nM
Citation
 PubChem, PC Fluorescence Cell-Free Homogeneous Dose Retest to Identify Inhibitors of RecA-Intein Splicing Activity PubChem Bioassay (2010)[AID] 
Target
Name:
Protein RecA
Synonyms:
DNA recombination protein RecA recA
Type:
Enzyme Catalytic Domain
Mol. Mass.:
85386.52
Organism:
Mycobacterium tuberculosis H37Rv
Description:
gi_15609874
Residue:
790
  
Inhibitor
Name:
BDBM70355
Synonyms:
4-[6-amino-5-cyano-3-(4-methylphenyl)-1,4-dihydropyrano[2,3-c]pyrazol-4-yl]phenyl morpholine-4-carboxylate MLS000095729 [4-[6-amino-5-cyano-3-(4-methylphenyl)-2,4-dihydropyrano[2,3-c]pyrazol-4-yl]phenyl] morpholine-4-carboxylate cid_3238248 | morpholine-4-carboxylic acid [4-[6-amino-5-cyano-3-(p-tolyl)-2,4-dihydropyrano[2,3-c]pyrazol-4-yl]phenyl] ester
Type:
Small organic molecule
Emp. Form.:
C25H23N5O4
Mol. Mass.:
457.4812
SMILES:
Cc1ccc(cc1)-c1n[nH]c2OC(=N)C(C#N)C(c12)c1ccc(OC(=O)N2CCOCC2)cc1
: