Target
Protein RecA
Ligand
BDBM59701
Substrate
Meas. Tech.
Fluorescence Cell-Free Homogeneous Dose Retest to Identify Inhibitors of RecA-Intein Splicing Activity
EC50
852±n/a nM
Citation
 PubChem, PC Fluorescence Cell-Free Homogeneous Dose Retest to Identify Inhibitors of RecA-Intein Splicing Activity PubChem Bioassay (2010)[AID] 
Target
Name:
Protein RecA
Synonyms:
DNA recombination protein RecA recA
Type:
Enzyme Catalytic Domain
Mol. Mass.:
85386.52
Organism:
Mycobacterium tuberculosis H37Rv
Description:
gi_15609874
Residue:
790
  
Inhibitor
Name:
BDBM59701
Synonyms:
3-(3,4-dichlorophenyl)-1H-pyrazol-5-ol 5-(3,4-dichlorophenyl)-3-pyrazolin-3-one MLS000066902 cid_598633
Type:
Small organic molecule
Emp. Form.:
C9H6Cl2N2O
Mol. Mass.:
229.063
SMILES:
Clc1ccc(cc1Cl)-c1cc(=O)[nH][nH]1
: