Target
Eukaryotic translation initiation factor 4H
Ligand
BDBM73153
Substrate
Meas. Tech.
SAR analysis for the identification of translation initiation inhibitors (eIF4H)
IC50
>100000±n/a nM
Citation
 PubChem, PC SAR analysis for the identification of translation initiation inhibitors (eIF4H) PubChem Bioassay (2010)[AID] 
Target
Name:
Eukaryotic translation initiation factor 4H
Synonyms:
EIF4H KIAA0038 WSCR1
Type:
Enzyme Catalytic Domain
Mol. Mass.:
27385.24
Organism:
Homo sapiens (Human)
Description:
Q15056
Residue:
248
  
Inhibitor
Name:
BDBM73153
Synonyms:
4-(carbamoylamino)benzoic acid [2-(2-methoxy-5-nitroanilino)-2-oxoethyl] ester MLS-0435520.0001 [2-[(2-methoxy-5-nitro-phenyl)amino]-2-oxidanylidene-ethyl] 4-(aminocarbonylamino)benzoate | cid_2101256
Type:
Small organic molecule
Emp. Form.:
C17H16N4O7
Mol. Mass.:
388.3315
SMILES:
COc1ccc(cc1NC(=O)COC(=O)c1ccc(NC(N)=O)cc1)[N+]([O-])=O
: