Target
Eukaryotic translation initiation factor 4H
Ligand
BDBM73159
Substrate
Meas. Tech.
SAR analysis for the identification of translation initiation inhibitors (eIF4H)
IC50
>100000±n/a nM
Citation
 PubChem, PC SAR analysis for the identification of translation initiation inhibitors (eIF4H) PubChem Bioassay (2010)[AID] 
Target
Name:
Eukaryotic translation initiation factor 4H
Synonyms:
EIF4H KIAA0038 WSCR1
Type:
Enzyme Catalytic Domain
Mol. Mass.:
27385.24
Organism:
Homo sapiens (Human)
Description:
Q15056
Residue:
248
  
Inhibitor
Name:
BDBM73159
Synonyms:
2-benzoylbenzoic acid [2-(2-methoxy-5-nitroanilino)-2-oxoethyl] ester MLS-0230474.0001 [2-[(2-methoxy-5-nitro-phenyl)amino]-2-oxidanylidene-ethyl] 2-(phenylcarbonyl)benzoate | cid_2405975
Type:
Small organic molecule
Emp. Form.:
C23H18N2O7
Mol. Mass.:
434.3982
SMILES:
COc1ccc(cc1NC(=O)COC(=O)c1ccccc1C(=O)c1ccccc1)[N+]([O-])=O
: