Target
Eukaryotic translation initiation factor 4H
Ligand
BDBM73175
Substrate
Meas. Tech.
SAR analysis for the identification of translation initiation inhibitors (eIF4H)
IC50
>100000±n/a nM
Citation
 PubChem, PC SAR analysis for the identification of translation initiation inhibitors (eIF4H) PubChem Bioassay (2010)[AID] 
Target
Name:
Eukaryotic translation initiation factor 4H
Synonyms:
EIF4H KIAA0038 WSCR1
Type:
Enzyme Catalytic Domain
Mol. Mass.:
27385.24
Organism:
Homo sapiens (Human)
Description:
Q15056
Residue:
248
  
Inhibitor
Name:
BDBM73175
Synonyms:
6-amino-2-(8-methyl-5-quinolinyl)benzo[de]isoquinoline-1,3-dione 6-amino-2-(8-methylquinolin-5-yl)benzo[de]isoquinoline-1,3-dione MLS-0311998.0001 | cid_1075260
Type:
Small organic molecule
Emp. Form.:
C22H15N3O2
Mol. Mass.:
353.3734
SMILES:
Cc1ccc(N2C(=O)c3cccc4c(N)ccc(C2=O)c34)c2cccnc12
: