Target
Polyadenylate-binding protein 1
Ligand
BDBM61356
Substrate
Meas. Tech.
SAR analysis for the identification of translation initiation inhibitors (PABP)
IC50
20500±n/a nM
Citation
 PubChem, PC SAR analysis for the identification of translation initiation inhibitors (PABP) PubChem Bioassay (2010)[AID] 
Target
Name:
Polyadenylate-binding protein 1
Synonyms:
PAB1 PABP1 PABPC1 poly(A) binding protein, cytoplasmic 1 | polyadenylate-binding protein 1
Type:
Enzyme Catalytic Domain
Mol. Mass.:
70694.26
Organism:
Homo sapiens (Human)
Description:
gi_46367787
Residue:
636
  
Inhibitor
Name:
BDBM61356
Synonyms:
2-(4-naphthalen-2-ylsulfonylpiperazin-1-yl)-N-propan-2-yl-propanamide 2-[4-(2-naphthalenylsulfonyl)-1-piperazinyl]-N-propan-2-ylpropanamide N-isopropyl-2-[4-(2-naphthylsulfonyl)piperazino]propionamide cid_16283830
Type:
Small organic molecule
Emp. Form.:
C20H27N3O3S
Mol. Mass.:
389.512
SMILES:
CC(C)NC(=O)C(C)N1CCN(CC1)S(=O)(=O)c1ccc2ccccc2c1
: