Target
Polyadenylate-binding protein 1
Ligand
BDBM73178
Substrate
Meas. Tech.
SAR analysis for the identification of translation initiation inhibitors (PABP)
IC50
>100000±n/a nM
Citation
 PubChem, PC SAR analysis for the identification of translation initiation inhibitors (PABP) PubChem Bioassay (2010)[AID] 
Target
Name:
Polyadenylate-binding protein 1
Synonyms:
PAB1 PABP1 PABPC1 poly(A) binding protein, cytoplasmic 1 | polyadenylate-binding protein 1
Type:
Enzyme Catalytic Domain
Mol. Mass.:
70694.26
Organism:
Homo sapiens (Human)
Description:
gi_46367787
Residue:
636
  
Inhibitor
Name:
BDBM73178
Synonyms:
MLS-0335295.0001 N-(4-methylphenyl)-1-[oxo(thiophen-2-yl)methyl]-4-piperidinecarboxamide N-(p-tolyl)-1-(2-thenoyl)isonipecotamide | cid_1075485
Type:
Small organic molecule
Emp. Form.:
C18H20N2O2S
Mol. Mass.:
328.429
SMILES:
Cc1ccc(NC(=O)C2CCN(CC2)C(=O)c2cccs2)cc1
: