Target
Polyadenylate-binding protein 1
Ligand
BDBM73182
Substrate
Meas. Tech.
SAR analysis for the identification of translation initiation inhibitors (PABP)
IC50
>100000±n/a nM
Citation
 PubChem, PC SAR analysis for the identification of translation initiation inhibitors (PABP) PubChem Bioassay (2010)[AID] 
Target
Name:
Polyadenylate-binding protein 1
Synonyms:
PAB1 PABP1 PABPC1 poly(A) binding protein, cytoplasmic 1 | polyadenylate-binding protein 1
Type:
Enzyme Catalytic Domain
Mol. Mass.:
70694.26
Organism:
Homo sapiens (Human)
Description:
gi_46367787
Residue:
636
  
Inhibitor
Name:
BDBM73182
Synonyms:
4-keto-N-(4-methoxyphenyl)-2-(2-methoxyphenyl)imino-3-methyl-1,3-thiazinane-6-carboxamide N-(4-methoxyphenyl)-2-(2-methoxyphenyl)imino-3-methyl-4-oxidanylidene-1,3-thiazinane-6-carboxamide cid_3139920
Type:
Small organic molecule
Emp. Form.:
C20H21N3O4S
Mol. Mass.:
399.463
SMILES:
COc1ccc(NC(=O)C2CC(=O)N(C)\C(S2)=N\c2ccccc2OC)cc1
: