Target
Polyadenylate-binding protein 1
Ligand
BDBM73191
Substrate
Meas. Tech.
SAR analysis for the identification of translation initiation inhibitors (PABP)
IC50
>100000±n/a nM
Citation
 PubChem, PC SAR analysis for the identification of translation initiation inhibitors (PABP) PubChem Bioassay (2010)[AID] 
Target
Name:
Polyadenylate-binding protein 1
Synonyms:
PAB1 PABP1 PABPC1 poly(A) binding protein, cytoplasmic 1 | polyadenylate-binding protein 1
Type:
Enzyme Catalytic Domain
Mol. Mass.:
70694.26
Organism:
Homo sapiens (Human)
Description:
gi_46367787
Residue:
636
  
Inhibitor
Name:
BDBM73191
Synonyms:
2-[6-(furan-2-yl)pyridazin-3-yl]sulfanyl-N-(3-methylphenyl)acetamide 2-[[6-(2-furanyl)-3-pyridazinyl]thio]-N-(3-methylphenyl)acetamide MLS-0202462.0001 | cid_7207114
Type:
Small organic molecule
Emp. Form.:
C17H15N3O2S
Mol. Mass.:
325.385
SMILES:
Cc1cccc(NC(=O)CSc2ccc(nn2)-c2ccco2)c1
: