Target
Polyadenylate-binding protein 1
Ligand
BDBM73197
Substrate
Meas. Tech.
SAR analysis for the identification of translation initiation inhibitors (PABP)
IC50
>100000±n/a nM
Citation
 PubChem, PC SAR analysis for the identification of translation initiation inhibitors (PABP) PubChem Bioassay (2010)[AID] 
Target
Name:
Polyadenylate-binding protein 1
Synonyms:
PAB1 PABP1 PABPC1 poly(A) binding protein, cytoplasmic 1 | polyadenylate-binding protein 1
Type:
Enzyme Catalytic Domain
Mol. Mass.:
70694.26
Organism:
Homo sapiens (Human)
Description:
gi_46367787
Residue:
636
  
Inhibitor
Name:
BDBM73197
Synonyms:
3-ethyl-N-(4-fluorophenyl)-2-(2-methoxyphenyl)imino-4-oxidanylidene-1,3-thiazinane-6-carboxamide 3-ethyl-N-(4-fluorophenyl)-4-keto-2-(2-methoxyphenyl)imino-1,3-thiazinane-6-carboxamide cid_3143753
Type:
Small organic molecule
Emp. Form.:
C20H20FN3O3S
Mol. Mass.:
401.455
SMILES:
CCN1C(=O)CC(S\C1=N/c1ccccc1OC)C(=O)Nc1ccc(F)cc1
: