Target
Protein LANA1
Ligand
BDBM60343
Substrate
Meas. Tech.
Fluorescence Polarization Cell-Free Homogeneous Dose Retest to Confirm Inhibitors of the LANA Histone H2A/H2B Interaction
EC50
>75000±n/a nM
Citation
 PubChem, PC Fluorescence Polarization Cell-Free Homogeneous Dose Retest to Confirm Inhibitors of the LANA Histone H2A/H2B Interaction PubChem Bioassay (2010)[AID] 
Target
Name:
Protein LANA1
Synonyms:
LANA LANA1_HHV8P
Type:
Enzyme Catalytic Domain
Mol. Mass.:
131093.36
Organism:
Human herpesvirus 8
Description:
Q9QR71
Residue:
1129
  
Inhibitor
Name:
BDBM60343
Synonyms:
MLS000035128 N-[9-[2-[4-(dimethylamino)anilino]-2-oxoethyl]-9-azabicyclo[3.3.1]nonan-3-yl]-3-methoxybenzamide N-{9-[(4-Dimethylamino-phenylcarbamoyl)-methyl]-9-aza-bicyclo[3.3.1]non-3-yl}-3-methoxy-benzamide cid_645059
Type:
Small organic molecule
Emp. Form.:
C26H34N4O3
Mol. Mass.:
450.5732
SMILES:
[H]C12CCCC([H])(CC(C1)NC(=O)c1cccc(OC)c1)N2CC(=O)Nc1ccc(cc1)N(C)C
: