Target
Protein LANA1
Ligand
BDBM73336
Substrate
Meas. Tech.
Fluorescence Polarization Cell-Free Homogeneous Dose Retest to Confirm Inhibitors of the LANA Histone H2A/H2B Interaction
EC50
486.7±n/a nM
Citation
 PubChem, PC Fluorescence Polarization Cell-Free Homogeneous Dose Retest to Confirm Inhibitors of the LANA Histone H2A/H2B Interaction PubChem Bioassay (2010)[AID] 
Target
Name:
Protein LANA1
Synonyms:
LANA LANA1_HHV8P
Type:
Enzyme Catalytic Domain
Mol. Mass.:
131093.36
Organism:
Human herpesvirus 8
Description:
Q9QR71
Residue:
1129
  
Inhibitor
Name:
BDBM73336
Synonyms:
1-(3-{[6,8-dimethyl-2-(trifluoromethyl)-4-quinazolinyl]amino}propyl)-2-pyrrolidinone 1-[3-[[6,8-dimethyl-2-(trifluoromethyl)quinazolin-4-yl]amino]propyl]-2-pyrrolidone MLS000097378 cid_1630687
Type:
Small organic molecule
Emp. Form.:
C18H21F3N4O
Mol. Mass.:
366.3807
SMILES:
Cc1cc(C)c2nc(nc(NCCCN3CCCC3=O)c2c1)C(F)(F)F
: