Target
Protein LANA1
Ligand
BDBM73347
Substrate
Meas. Tech.
Fluorescence Polarization Cell-Free Homogeneous Dose Retest to Confirm Inhibitors of the LANA Histone H2A/H2B Interaction
EC50
13370±n/a nM
Citation
 PubChem, PC Fluorescence Polarization Cell-Free Homogeneous Dose Retest to Confirm Inhibitors of the LANA Histone H2A/H2B Interaction PubChem Bioassay (2010)[AID] 
Target
Name:
Protein LANA1
Synonyms:
LANA LANA1_HHV8P
Type:
Enzyme Catalytic Domain
Mol. Mass.:
131093.36
Organism:
Human herpesvirus 8
Description:
Q9QR71
Residue:
1129
  
Inhibitor
Name:
BDBM73347
Synonyms:
1,3-dimethoxy-2-[2-(3-methoxyphenoxy)ethoxy]benzene SMR000070956 | cid_2283858
Type:
Small organic molecule
Emp. Form.:
C17H20O5
Mol. Mass.:
304.3377
SMILES:
COc1cccc(OCCOc2c(OC)cccc2OC)c1
: