Target
Protein LANA1
Ligand
BDBM73893
Substrate
Meas. Tech.
Fluorescence Polarization Cell-Free Homogeneous Dose Retest to Confirm Inhibitors of the LANA Histone H2A/H2B Interaction
EC50
6104±n/a nM
Citation
 PubChem, PC Fluorescence Polarization Cell-Free Homogeneous Dose Retest to Confirm Inhibitors of the LANA Histone H2A/H2B Interaction PubChem Bioassay (2010)[AID] 
Target
Name:
Protein LANA1
Synonyms:
LANA LANA1_HHV8P
Type:
Enzyme Catalytic Domain
Mol. Mass.:
131093.36
Organism:
Human herpesvirus 8
Description:
Q9QR71
Residue:
1129
  
Inhibitor
Name:
BDBM73893
Synonyms:
(3-Fluoro-phenyl)-[3-(3-p-tolyl-[1,2,4]oxadiazol-5-yl)-piperidin-1-yl]-methanone (3-fluorophenyl)-[3-[3-(4-methylphenyl)-1,2,4-oxadiazol-5-yl]piperidin-1-yl]methanone MLS001202931 cid_3226144
Type:
Small organic molecule
Emp. Form.:
C21H20FN3O2
Mol. Mass.:
365.4008
SMILES:
Cc1ccc(cc1)-c1noc(n1)C1CCCN(C1)C(=O)c1cccc(F)c1
: