Target
Protein LANA1
Ligand
BDBM74333
Substrate
Meas. Tech.
Fluorescence Polarization Cell-Free Homogeneous Dose Retest to Confirm Inhibitors of the LANA Histone H2A/H2B Interaction
EC50
>75000±n/a nM
Citation
 PubChem, PC Fluorescence Polarization Cell-Free Homogeneous Dose Retest to Confirm Inhibitors of the LANA Histone H2A/H2B Interaction PubChem Bioassay (2010)[AID] 
Target
Name:
Protein LANA1
Synonyms:
LANA LANA1_HHV8P
Type:
Enzyme Catalytic Domain
Mol. Mass.:
131093.36
Organism:
Human herpesvirus 8
Description:
Q9QR71
Residue:
1129
  
Inhibitor
Name:
BDBM74333
Synonyms:
MLS002171216 N-[4-methoxy-3-(2-pyridin-2-ylethylsulfamoyl)phenyl]ethanamide N-[4-methoxy-3-[2-(2-pyridyl)ethylsulfamoyl]phenyl]acetamide cid_4877197
Type:
Small organic molecule
Emp. Form.:
C16H19N3O4S
Mol. Mass.:
349.405
SMILES:
COc1ccc(NC(C)=O)cc1S(=O)(=O)NCCc1ccccn1
: